Information card for entry 4127860
Formula | C131 H164 Cl3 O20 |
Calculated formula | C131 H164 Cl3 O20 |
Title of publication | Separation of Monochlorotoluene Isomers by Nonporous Adaptive Crystals of Perethylated Pillar[5]arene and Pillar[6]arene. |
Authors of publication | Wang, Mengbin; Zhou, Jiong; Li, Errui; Zhou, Yujuan; Li, Qing; Huang, Feihe |
Journal of publication | Journal of the American Chemical Society |
Year of publication | 2019 |
Journal volume | 141 |
Journal issue | 43 |
Pages of publication | 17102 - 17106 |
a | 11.6711 ± 0.0004 Å |
b | 21.551 ± 0.0006 Å |
c | 23.8501 ± 0.0008 Å |
α | 90° |
β | 95.321 ± 0.001° |
γ | 90° |
Cell volume | 5973 ± 0.3 Å3 |
Cell temperature | 273 ± 2 K |
Ambient diffraction temperature | 273 ± 2 K |
Number of distinct elements | 4 |
Space group number | 14 |
Hermann-Mauguin space group symbol | P 1 21/n 1 |
Hall space group symbol | -P 2yn |
Residual factor for all reflections | 0.0944 |
Residual factor for significantly intense reflections | 0.0672 |
Weighted residual factors for significantly intense reflections | 0.1723 |
Weighted residual factors for all reflections included in the refinement | 0.1885 |
Goodness-of-fit parameter for all reflections included in the refinement | 1.075 |
Diffraction radiation wavelength | 0.71073 Å |
Diffraction radiation type | MoKα |