Information card for entry 4127861
Formula | C73 H92 Cl O12 |
Calculated formula | C73 H92 Cl O12 |
Title of publication | Separation of Monochlorotoluene Isomers by Nonporous Adaptive Crystals of Perethylated Pillar[5]arene and Pillar[6]arene. |
Authors of publication | Wang, Mengbin; Zhou, Jiong; Li, Errui; Zhou, Yujuan; Li, Qing; Huang, Feihe |
Journal of publication | Journal of the American Chemical Society |
Year of publication | 2019 |
Journal volume | 141 |
Journal issue | 43 |
Pages of publication | 17102 - 17106 |
a | 11.607 ± 0.003 Å |
b | 12.917 ± 0.003 Å |
c | 22.363 ± 0.005 Å |
α | 90° |
β | 91.31 ± 0.008° |
γ | 90° |
Cell volume | 3352 ± 1.4 Å3 |
Cell temperature | 296 ± 2 K |
Ambient diffraction temperature | 296 ± 2 K |
Number of distinct elements | 4 |
Space group number | 14 |
Hermann-Mauguin space group symbol | P 1 21/n 1 |
Hall space group symbol | -P 2yn |
Residual factor for all reflections | 0.1492 |
Residual factor for significantly intense reflections | 0.0723 |
Weighted residual factors for significantly intense reflections | 0.1851 |
Weighted residual factors for all reflections included in the refinement | 0.2287 |
Goodness-of-fit parameter for all reflections included in the refinement | 1.017 |
Diffraction radiation wavelength | 0.71073 Å |
Diffraction radiation type | MoKα |