Information card for entry 4127862
Formula | C48 H66 Cl N2 O P Ru |
Calculated formula | C48 H66 Cl N2 O P Ru |
Title of publication | Ruthenium-Catalyzed (<i>Z</i>)-Selective Hydroboration of Terminal Alkynes with Naphthalene-1,8-diaminatoborane. |
Authors of publication | Yamamoto, Kensuke; Mohara, Yusei; Mutoh, Yuichiro; Saito, Shinichi |
Journal of publication | Journal of the American Chemical Society |
Year of publication | 2019 |
Journal volume | 141 |
Journal issue | 43 |
Pages of publication | 17042 - 17047 |
a | 11.8197 ± 0.0018 Å |
b | 31.293 ± 0.005 Å |
c | 13.219 ± 0.002 Å |
α | 90° |
β | 113.124 ± 0.002° |
γ | 90° |
Cell volume | 4496.5 ± 1.2 Å3 |
Cell temperature | 100 ± 2 K |
Ambient diffraction temperature | 100 ± 2 K |
Number of distinct elements | 7 |
Space group number | 14 |
Hermann-Mauguin space group symbol | P 1 21/c 1 |
Hall space group symbol | -P 2ybc |
Residual factor for all reflections | 0.063 |
Residual factor for significantly intense reflections | 0.0528 |
Weighted residual factors for significantly intense reflections | 0.1068 |
Weighted residual factors for all reflections included in the refinement | 0.1105 |
Goodness-of-fit parameter for all reflections included in the refinement | 1.144 |
Diffraction radiation wavelength | 0.71073 Å |
Diffraction radiation type | MoKα |