Information card for entry 4127866
Formula | C19 H17 B N2 O |
Calculated formula | C19 H17 B N2 O |
SMILES | C(=C\c1ccc(cc1)OC)\B1Nc2cccc3cccc(N1)c23 |
Title of publication | Ruthenium-Catalyzed (<i>Z</i>)-Selective Hydroboration of Terminal Alkynes with Naphthalene-1,8-diaminatoborane. |
Authors of publication | Yamamoto, Kensuke; Mohara, Yusei; Mutoh, Yuichiro; Saito, Shinichi |
Journal of publication | Journal of the American Chemical Society |
Year of publication | 2019 |
Journal volume | 141 |
Journal issue | 43 |
Pages of publication | 17042 - 17047 |
a | 8.6383 ± 0.0007 Å |
b | 13.5782 ± 0.0012 Å |
c | 26.556 ± 0.002 Å |
α | 90° |
β | 90° |
γ | 90° |
Cell volume | 3114.8 ± 0.4 Å3 |
Cell temperature | 100 ± 2 K |
Ambient diffraction temperature | 100 ± 2 K |
Number of distinct elements | 5 |
Space group number | 61 |
Hermann-Mauguin space group symbol | P b c a |
Hall space group symbol | -P 2ac 2ab |
Residual factor for all reflections | 0.0448 |
Residual factor for significantly intense reflections | 0.0365 |
Weighted residual factors for significantly intense reflections | 0.0929 |
Weighted residual factors for all reflections included in the refinement | 0.0987 |
Goodness-of-fit parameter for all reflections included in the refinement | 1.034 |
Diffraction radiation wavelength | 0.71073 Å |
Diffraction radiation type | MoKα |