Information card for entry 4127867
Formula | C24 H19 B N2 |
Calculated formula | C24 H19 B N2 |
SMILES | C(=C\c1ccccc1)(B1Nc2cccc3cccc(N1)c23)/c1ccccc1 |
Title of publication | Ruthenium-Catalyzed (<i>Z</i>)-Selective Hydroboration of Terminal Alkynes with Naphthalene-1,8-diaminatoborane. |
Authors of publication | Yamamoto, Kensuke; Mohara, Yusei; Mutoh, Yuichiro; Saito, Shinichi |
Journal of publication | Journal of the American Chemical Society |
Year of publication | 2019 |
Journal volume | 141 |
Journal issue | 43 |
Pages of publication | 17042 - 17047 |
a | 7.4717 ± 0.0008 Å |
b | 12.2883 ± 0.0013 Å |
c | 19.718 ± 0.002 Å |
α | 90° |
β | 90° |
γ | 90° |
Cell volume | 1810.4 ± 0.3 Å3 |
Cell temperature | 100 ± 2 K |
Ambient diffraction temperature | 100 ± 2 K |
Number of distinct elements | 4 |
Space group number | 19 |
Hermann-Mauguin space group symbol | P 21 21 21 |
Hall space group symbol | P 2ac 2ab |
Residual factor for all reflections | 0.0429 |
Residual factor for significantly intense reflections | 0.037 |
Weighted residual factors for significantly intense reflections | 0.0781 |
Weighted residual factors for all reflections included in the refinement | 0.0812 |
Goodness-of-fit parameter for all reflections included in the refinement | 1.051 |
Diffraction radiation wavelength | 0.71073 Å |
Diffraction radiation type | MoKα |