Information card for entry 4127869
Formula | C56 H74 Cl N6 |
Calculated formula | C56 H74 Cl N6 |
Title of publication | Synthesis of Organic Super-Electron-Donors by Reaction of Nitrous Oxide with N-Heterocyclic Olefins. |
Authors of publication | Eymann, Léonard Y M; Varava, Paul; Shved, Andrei M.; Curchod, Basile F. E.; Liu, Yizhu; Planes, Ophélie M; Sienkiewicz, Andrzej; Scopelliti, Rosario; Fadaei Tirani, Farzaneh; Severin, Kay |
Journal of publication | Journal of the American Chemical Society |
Year of publication | 2019 |
Journal volume | 141 |
Journal issue | 43 |
Pages of publication | 17112 - 17116 |
a | 21.4308 ± 0.0005 Å |
b | 16.6188 ± 0.0004 Å |
c | 15.7436 ± 0.0004 Å |
α | 90° |
β | 109.082 ± 0.002° |
γ | 90° |
Cell volume | 5299 ± 0.2 Å3 |
Cell temperature | 140 ± 0.1 K |
Ambient diffraction temperature | 140 ± 0.1 K |
Number of distinct elements | 4 |
Space group number | 15 |
Hermann-Mauguin space group symbol | C 1 2/c 1 |
Hall space group symbol | -C 2yc |
Residual factor for all reflections | 0.0737 |
Residual factor for significantly intense reflections | 0.0582 |
Weighted residual factors for significantly intense reflections | 0.1729 |
Weighted residual factors for all reflections included in the refinement | 0.1841 |
Goodness-of-fit parameter for all reflections included in the refinement | 1.065 |
Diffraction radiation probe | x-ray |
Diffraction radiation wavelength | 1.54184 Å |
Diffraction radiation type | CuKα |