Information card for entry 4127870
Formula | C56 H74 I N6 |
Calculated formula | C56 H74 I N6 |
Title of publication | Synthesis of Organic Super-Electron-Donors by Reaction of Nitrous Oxide with N-Heterocyclic Olefins. |
Authors of publication | Eymann, Léonard Y M; Varava, Paul; Shved, Andrei M.; Curchod, Basile F. E.; Liu, Yizhu; Planes, Ophélie M; Sienkiewicz, Andrzej; Scopelliti, Rosario; Fadaei Tirani, Farzaneh; Severin, Kay |
Journal of publication | Journal of the American Chemical Society |
Year of publication | 2019 |
Journal volume | 141 |
Journal issue | 43 |
Pages of publication | 17112 - 17116 |
a | 12.2031 ± 0.0004 Å |
b | 16.0891 ± 0.0005 Å |
c | 19.0062 ± 0.0005 Å |
α | 105.338 ± 0.002° |
β | 96.22 ± 0.003° |
γ | 107.663 ± 0.003° |
Cell volume | 3356.1 ± 0.2 Å3 |
Cell temperature | 140 ± 0.1 K |
Ambient diffraction temperature | 140 ± 0.1 K |
Number of distinct elements | 4 |
Space group number | 2 |
Hermann-Mauguin space group symbol | P -1 |
Hall space group symbol | -P 1 |
Residual factor for all reflections | 0.0854 |
Residual factor for significantly intense reflections | 0.0525 |
Weighted residual factors for significantly intense reflections | 0.119 |
Weighted residual factors for all reflections included in the refinement | 0.1321 |
Goodness-of-fit parameter for all reflections included in the refinement | 1.025 |
Diffraction radiation probe | x-ray |
Diffraction radiation wavelength | 0.71073 Å |
Diffraction radiation type | MoKα |