Information card for entry 4127871
Formula | C58 H74 F6 N7 O4 S2 |
Calculated formula | C58 H74 F6 N7 O4 S2 |
Title of publication | Synthesis of Organic Super-Electron-Donors by Reaction of Nitrous Oxide with N-Heterocyclic Olefins. |
Authors of publication | Eymann, Léonard Y M; Varava, Paul; Shved, Andrei M.; Curchod, Basile F. E.; Liu, Yizhu; Planes, Ophélie M; Sienkiewicz, Andrzej; Scopelliti, Rosario; Fadaei Tirani, Farzaneh; Severin, Kay |
Journal of publication | Journal of the American Chemical Society |
Year of publication | 2019 |
Journal volume | 141 |
Journal issue | 43 |
Pages of publication | 17112 - 17116 |
a | 11.9866 ± 0.0004 Å |
b | 12.3158 ± 0.0005 Å |
c | 12.5454 ± 0.0005 Å |
α | 70.545 ± 0.003° |
β | 88.449 ± 0.003° |
γ | 61.047 ± 0.004° |
Cell volume | 1507.67 ± 0.13 Å3 |
Cell temperature | 140 ± 0.1 K |
Ambient diffraction temperature | 140 ± 0.1 K |
Number of distinct elements | 6 |
Space group number | 2 |
Hermann-Mauguin space group symbol | P -1 |
Hall space group symbol | -P 1 |
Residual factor for all reflections | 0.0414 |
Residual factor for significantly intense reflections | 0.038 |
Weighted residual factors for significantly intense reflections | 0.1 |
Weighted residual factors for all reflections included in the refinement | 0.1028 |
Goodness-of-fit parameter for all reflections included in the refinement | 1.031 |
Diffraction radiation probe | x-ray |
Diffraction radiation wavelength | 1.54184 Å |
Diffraction radiation type | CuKα |