Information card for entry 4127889
Formula | C33.1 H51.9 N3.7 O15.7 S2 Zn4 |
Calculated formula | C28 H26 N2 O12 S2 Zn4 |
Title of publication | Tuning the Molecular and Cationic Affinity in a Series of Multifunctional Metal-Organic Frameworks Based on Dodecanuclear Zn(II) Carboxylate Wheels. |
Authors of publication | Lysova, Anna A.; Samsonenko, Denis G.; Dorovatovskii, Pavel V.; Lazarenko, Vladimir A.; Khrustalev, Victor N.; Kovalenko, Konstantin A.; Dybtsev, Danil N.; Fedin, Vladimir P. |
Journal of publication | Journal of the American Chemical Society |
Year of publication | 2019 |
Journal volume | 141 |
Journal issue | 43 |
Pages of publication | 17260 - 17269 |
a | 32.0583 ± 0.0008 Å |
b | 32.0583 ± 0.0008 Å |
c | 11.503 ± 0.0003 Å |
α | 90° |
β | 90° |
γ | 120° |
Cell volume | 10238.2 ± 0.4 Å3 |
Cell temperature | 130 ± 2 K |
Ambient diffraction temperature | 130 ± 2 K |
Number of distinct elements | 6 |
Space group number | 166 |
Hermann-Mauguin space group symbol | R -3 m :H |
Hall space group symbol | -R 3 2" |
Residual factor for all reflections | 0.0345 |
Residual factor for significantly intense reflections | 0.0267 |
Weighted residual factors for significantly intense reflections | 0.0711 |
Weighted residual factors for all reflections included in the refinement | 0.074 |
Goodness-of-fit parameter for all reflections included in the refinement | 1.061 |
Diffraction radiation probe | x-ray |
Diffraction radiation wavelength | 0.71073 Å |
Diffraction radiation type | MoKα |