Information card for entry 4127890
Formula | C29.5 H43.5 N4.5 O15.5 S2 Zn4 |
Calculated formula | C22 H24 N2 O12 S2 Zn4 |
Title of publication | Tuning the Molecular and Cationic Affinity in a Series of Multifunctional Metal-Organic Frameworks Based on Dodecanuclear Zn(II) Carboxylate Wheels. |
Authors of publication | Lysova, Anna A.; Samsonenko, Denis G.; Dorovatovskii, Pavel V.; Lazarenko, Vladimir A.; Khrustalev, Victor N.; Kovalenko, Konstantin A.; Dybtsev, Danil N.; Fedin, Vladimir P. |
Journal of publication | Journal of the American Chemical Society |
Year of publication | 2019 |
Journal volume | 141 |
Journal issue | 43 |
Pages of publication | 17260 - 17269 |
a | 31.7477 ± 0.0014 Å |
b | 31.7477 ± 0.0014 Å |
c | 11.6653 ± 0.0007 Å |
α | 90° |
β | 90° |
γ | 120° |
Cell volume | 10182.4 ± 0.9 Å3 |
Cell temperature | 130 ± 2 K |
Ambient diffraction temperature | 130 ± 2 K |
Number of distinct elements | 6 |
Space group number | 166 |
Hermann-Mauguin space group symbol | R -3 m :H |
Hall space group symbol | -R 3 2" |
Residual factor for all reflections | 0.089 |
Residual factor for significantly intense reflections | 0.061 |
Weighted residual factors for significantly intense reflections | 0.1805 |
Weighted residual factors for all reflections included in the refinement | 0.1955 |
Goodness-of-fit parameter for all reflections included in the refinement | 1.079 |
Diffraction radiation probe | x-ray |
Diffraction radiation wavelength | 0.71073 Å |
Diffraction radiation type | MoKα |