Information card for entry 4127910
Formula | C18 H22 O5 Si2 |
Calculated formula | C18 H22 O5 Si2 |
SMILES | [Si](O[Si](C)(C)C)(c1ccc(cc1)C(=O)O)(c1ccc(C(=O)O)cc1)C |
Title of publication | Aerobic Co-/ N-Hydroxysuccinimide-Catalyzed Oxidation of p-Tolylsiloxanes to p-Carboxyphenylsiloxanes: Synthesis of Functionalized Siloxanes as Promising Building Blocks for Siloxane-Based Materials. |
Authors of publication | Goncharova, Irina K.; Silaeva, Kseniia P.; Arzumanyan, Ashot V.; Anisimov, Anton A.; Milenin, Sergey A.; Novikov, Roman A.; Solyev, Pavel N.; Tkachev, Yaroslav V.; Volodin, Alexander D.; Korlyukov, Alexander A.; Muzafarov, Aziz M. |
Journal of publication | Journal of the American Chemical Society |
Year of publication | 2019 |
Journal volume | 141 |
Journal issue | 5 |
Pages of publication | 2143 - 2151 |
a | 7.044 ± 0.004 Å |
b | 9.866 ± 0.006 Å |
c | 16.064 ± 0.009 Å |
α | 97.263 ± 0.009° |
β | 94.629 ± 0.009° |
γ | 108.783 ± 0.006° |
Cell volume | 1039.7 ± 1 Å3 |
Cell temperature | 120 K |
Ambient diffraction temperature | 120 K |
Number of distinct elements | 4 |
Space group number | 2 |
Hermann-Mauguin space group symbol | P -1 |
Hall space group symbol | -P 1 |
Residual factor for all reflections | 0.1189 |
Residual factor for significantly intense reflections | 0.0784 |
Weighted residual factors for significantly intense reflections | 0.2122 |
Weighted residual factors for all reflections included in the refinement | 0.2288 |
Goodness-of-fit parameter for all reflections included in the refinement | 0.987 |
Diffraction radiation wavelength | 0.71073 Å |
Diffraction radiation type | MoKα |