Information card for entry 4127911
Formula | C18 H22 O5 Si2 |
Calculated formula | C18 H22 O5 Si2 |
SMILES | [Si](O[Si](c1ccc(cc1)C(=O)O)(C)C)(c1ccc(cc1)C(=O)O)(C)C |
Title of publication | Aerobic Co-/ N-Hydroxysuccinimide-Catalyzed Oxidation of p-Tolylsiloxanes to p-Carboxyphenylsiloxanes: Synthesis of Functionalized Siloxanes as Promising Building Blocks for Siloxane-Based Materials. |
Authors of publication | Goncharova, Irina K.; Silaeva, Kseniia P.; Arzumanyan, Ashot V.; Anisimov, Anton A.; Milenin, Sergey A.; Novikov, Roman A.; Solyev, Pavel N.; Tkachev, Yaroslav V.; Volodin, Alexander D.; Korlyukov, Alexander A.; Muzafarov, Aziz M. |
Journal of publication | Journal of the American Chemical Society |
Year of publication | 2019 |
Journal volume | 141 |
Journal issue | 5 |
Pages of publication | 2143 - 2151 |
a | 8.451 ± 0.003 Å |
b | 8.701 ± 0.003 Å |
c | 13.195 ± 0.005 Å |
α | 98.271 ± 0.007° |
β | 90.712 ± 0.007° |
γ | 90.314 ± 0.008° |
Cell volume | 960.1 ± 0.6 Å3 |
Cell temperature | 120 K |
Ambient diffraction temperature | 120 K |
Number of distinct elements | 4 |
Space group number | 2 |
Hermann-Mauguin space group symbol | P -1 |
Hall space group symbol | -P 1 |
Residual factor for all reflections | 0.1225 |
Residual factor for significantly intense reflections | 0.0951 |
Weighted residual factors for significantly intense reflections | 0.2036 |
Weighted residual factors for all reflections included in the refinement | 0.2128 |
Goodness-of-fit parameter for all reflections included in the refinement | 0.93 |
Diffraction radiation probe | x-ray |
Diffraction radiation wavelength | 0.71073 Å |
Diffraction radiation type | MoKα |