Information card for entry 4127913
Formula | C12 H20 O3 Si2 |
Calculated formula | C12 H20 O3 Si2 |
SMILES | [Si](O[Si](C)(C)C)(c1ccc(C(=O)O)cc1)(C)C |
Title of publication | Aerobic Co-/ N-Hydroxysuccinimide-Catalyzed Oxidation of p-Tolylsiloxanes to p-Carboxyphenylsiloxanes: Synthesis of Functionalized Siloxanes as Promising Building Blocks for Siloxane-Based Materials. |
Authors of publication | Goncharova, Irina K.; Silaeva, Kseniia P.; Arzumanyan, Ashot V.; Anisimov, Anton A.; Milenin, Sergey A.; Novikov, Roman A.; Solyev, Pavel N.; Tkachev, Yaroslav V.; Volodin, Alexander D.; Korlyukov, Alexander A.; Muzafarov, Aziz M. |
Journal of publication | Journal of the American Chemical Society |
Year of publication | 2019 |
Journal volume | 141 |
Journal issue | 5 |
Pages of publication | 2143 - 2151 |
a | 7.2406 ± 0.0016 Å |
b | 12.798 ± 0.003 Å |
c | 17.089 ± 0.004 Å |
α | 81.306 ± 0.006° |
β | 81.036 ± 0.006° |
γ | 85.912 ± 0.005° |
Cell volume | 1544.4 ± 0.6 Å3 |
Cell temperature | 120 K |
Ambient diffraction temperature | 120 K |
Number of distinct elements | 4 |
Space group number | 2 |
Hermann-Mauguin space group symbol | P -1 |
Hall space group symbol | -P 1 |
Residual factor for all reflections | 0.1224 |
Residual factor for significantly intense reflections | 0.0717 |
Weighted residual factors for significantly intense reflections | 0.1707 |
Weighted residual factors for all reflections included in the refinement | 0.2003 |
Goodness-of-fit parameter for all reflections included in the refinement | 1.002 |
Diffraction radiation probe | x-ray |
Diffraction radiation wavelength | 0.71073 Å |
Diffraction radiation type | MoKα |