Information card for entry 4127914
Formula | C20 H26 O5 Si2 |
Calculated formula | C20 H26 O5 Si2 |
SMILES | [Si](O[Si](c1ccc(cc1)C(=O)OC)(C)C)(c1ccc(cc1)C(=O)OC)(C)C |
Title of publication | Aerobic Co-/ N-Hydroxysuccinimide-Catalyzed Oxidation of p-Tolylsiloxanes to p-Carboxyphenylsiloxanes: Synthesis of Functionalized Siloxanes as Promising Building Blocks for Siloxane-Based Materials. |
Authors of publication | Goncharova, Irina K.; Silaeva, Kseniia P.; Arzumanyan, Ashot V.; Anisimov, Anton A.; Milenin, Sergey A.; Novikov, Roman A.; Solyev, Pavel N.; Tkachev, Yaroslav V.; Volodin, Alexander D.; Korlyukov, Alexander A.; Muzafarov, Aziz M. |
Journal of publication | Journal of the American Chemical Society |
Year of publication | 2019 |
Journal volume | 141 |
Journal issue | 5 |
Pages of publication | 2143 - 2151 |
a | 10.3251 ± 0.0007 Å |
b | 11.224 ± 0.0008 Å |
c | 11.3432 ± 0.0008 Å |
α | 96.522 ± 0.001° |
β | 111.319 ± 0.001° |
γ | 115.39 ± 0.001° |
Cell volume | 1048.07 ± 0.13 Å3 |
Cell temperature | 120 K |
Ambient diffraction temperature | 120 K |
Number of distinct elements | 4 |
Space group number | 2 |
Hermann-Mauguin space group symbol | P -1 |
Hall space group symbol | -P 1 |
Residual factor for all reflections | 0.0432 |
Residual factor for significantly intense reflections | 0.0347 |
Weighted residual factors for significantly intense reflections | 0.0921 |
Weighted residual factors for all reflections included in the refinement | 0.0987 |
Goodness-of-fit parameter for all reflections included in the refinement | 1.02 |
Diffraction radiation wavelength | 0.71073 Å |
Diffraction radiation type | MoKα |