Information card for entry 4127916
Formula | C38 H61 Ge N2 Si |
Calculated formula | C38 H61 Ge N2 Si |
SMILES | [Ge](=C1N(C(CC21CCCCC2)(C)C)c1c(cccc1C(C)C)C(C)C)N([Si](C)(C)C)c1c(cccc1C(C)C)C(C)C |
Title of publication | Isolation of Transient Acyclic Germanium(I) Radicals Stabilized by Cyclic Alkyl(amino) Carbenes. |
Authors of publication | Siddiqui, Mujahuddin M.; Sarkar, Samir Kumar; Sinhababu, Soumen; Ruth, Paul Niklas; Herbst-Irmer, Regine; Stalke, Dietmar; Ghosh, Munmun; Fu, Mingxing; Zhao, Lili; Casanova, David; Frenking, Gernot; Schwederski, Brigitte; Kaim, Wolfgang; Roesky, Herbert W. |
Journal of publication | Journal of the American Chemical Society |
Year of publication | 2019 |
Journal volume | 141 |
Journal issue | 5 |
Pages of publication | 1908 - 1912 |
a | 9.57 ± 0.002 Å |
b | 11.955 ± 0.002 Å |
c | 17.699 ± 0.003 Å |
α | 104.34 ± 0.02° |
β | 93.68 ± 0.02° |
γ | 108.63 ± 0.03° |
Cell volume | 1836.3 ± 0.7 Å3 |
Cell temperature | 100 ± 2 K |
Ambient diffraction temperature | 100 ± 2 K |
Number of distinct elements | 5 |
Space group number | 2 |
Hermann-Mauguin space group symbol | P -1 |
Hall space group symbol | -P 1 |
Residual factor for all reflections | 0.0538 |
Residual factor for significantly intense reflections | 0.0436 |
Weighted residual factors for significantly intense reflections | 0.1124 |
Weighted residual factors for all reflections included in the refinement | 0.1192 |
Goodness-of-fit parameter for all reflections included in the refinement | 1.076 |
Diffraction radiation wavelength | 0.56086 Å |
Diffraction radiation type | AgKα |