Information card for entry 4127917
Formula | C47 H57 Ge N2 Si |
Calculated formula | C47 H57 Ge N2 Si |
SMILES | [Ge](N([Si](c1ccccc1)(c1ccccc1)c1ccccc1)c1c(cc(cc1C)C)C)=C1N(C(CC1(C)C)(C)C)c1c(cccc1C(C)C)C(C)C |
Title of publication | Isolation of Transient Acyclic Germanium(I) Radicals Stabilized by Cyclic Alkyl(amino) Carbenes. |
Authors of publication | Siddiqui, Mujahuddin M.; Sarkar, Samir Kumar; Sinhababu, Soumen; Ruth, Paul Niklas; Herbst-Irmer, Regine; Stalke, Dietmar; Ghosh, Munmun; Fu, Mingxing; Zhao, Lili; Casanova, David; Frenking, Gernot; Schwederski, Brigitte; Kaim, Wolfgang; Roesky, Herbert W. |
Journal of publication | Journal of the American Chemical Society |
Year of publication | 2019 |
Journal volume | 141 |
Journal issue | 5 |
Pages of publication | 1908 - 1912 |
a | 13.375 ± 0.002 Å |
b | 13.416 ± 0.002 Å |
c | 14.015 ± 0.003 Å |
α | 112.83 ± 0.02° |
β | 100.59 ± 0.02° |
γ | 108.21 ± 0.03° |
Cell volume | 2063.8 ± 1 Å3 |
Cell temperature | 100 ± 2 K |
Ambient diffraction temperature | 100 ± 2 K |
Number of distinct elements | 5 |
Space group number | 2 |
Hermann-Mauguin space group symbol | P -1 |
Hall space group symbol | -P 1 |
Residual factor for all reflections | 0.0693 |
Residual factor for significantly intense reflections | 0.0459 |
Weighted residual factors for significantly intense reflections | 0.1073 |
Weighted residual factors for all reflections included in the refinement | 0.1251 |
Goodness-of-fit parameter for all reflections included in the refinement | 1.118 |
Diffraction radiation wavelength | 0.56086 Å |
Diffraction radiation type | AgKα |