Information card for entry 4127918
Formula | C96 H415 K23 O300 P20 Pd31 |
Calculated formula | C96 H112 K17.8333 O221.508 P20 Pd31 |
Title of publication | Polyoxometalate-Cyclodextrin Metal-Organic Frameworks: From Tunable Structure to Customized Storage Functionality. |
Authors of publication | Yang, Peng; Zhao, Wenli; Shkurenko, Aleksander; Belmabkhout, Youssef; Eddaoudi, Mohamed; Dong, Xiaochen; Alshareef, Husam N.; Khashab, Niveen M. |
Journal of publication | Journal of the American Chemical Society |
Year of publication | 2019 |
Journal volume | 141 |
Journal issue | 5 |
Pages of publication | 1847 - 1851 |
a | 13.5988 ± 0.0008 Å |
b | 47.708 ± 0.003 Å |
c | 50.646 ± 0.003 Å |
α | 90° |
β | 90° |
γ | 90° |
Cell volume | 32858 ± 3 Å3 |
Cell temperature | 100 ± 0.1 K |
Ambient diffraction temperature | 100 ± 0.1 K |
Number of distinct elements | 6 |
Space group number | 19 |
Hermann-Mauguin space group symbol | P 21 21 21 |
Hall space group symbol | P 2ac 2ab |
Residual factor for all reflections | 0.082 |
Residual factor for significantly intense reflections | 0.0772 |
Weighted residual factors for significantly intense reflections | 0.216 |
Weighted residual factors for all reflections included in the refinement | 0.2218 |
Goodness-of-fit parameter for all reflections included in the refinement | 1.031 |
Diffraction radiation wavelength | 1.54178 Å |
Diffraction radiation type | CuKα |