Information card for entry 4127990
Formula | C45 H52 Mo O2 P2 |
Calculated formula | C45 H52 Mo O2 P2 |
Title of publication | CO Coupling Chemistry of a Terminal Mo Carbide: Sequential Addition of Proton, Hydride, and CO Releases Ethenone. |
Authors of publication | Buss, Joshua A.; Bailey, Gwendolyn A.; Oppenheim, Julius; VanderVelde, David G.; Goddard, 3rd, William A; Agapie, Theodor |
Journal of publication | Journal of the American Chemical Society |
Year of publication | 2019 |
Journal volume | 141 |
Journal issue | 39 |
Pages of publication | 15664 - 15674 |
a | 11.665 ± 0.008 Å |
b | 12.561 ± 0.005 Å |
c | 13.985 ± 0.006 Å |
α | 72.96 ± 0.04° |
β | 81.2 ± 0.05° |
γ | 88.33 ± 0.04° |
Cell volume | 1935.9 ± 1.8 Å3 |
Cell temperature | 100 ± 2 K |
Ambient diffraction temperature | 100 K |
Number of distinct elements | 5 |
Space group number | 2 |
Hermann-Mauguin space group symbol | P -1 |
Hall space group symbol | -P 1 |
Residual factor for all reflections | 0.0291 |
Residual factor for significantly intense reflections | 0.0224 |
Weighted residual factors for significantly intense reflections | 0.0529 |
Weighted residual factors for all reflections included in the refinement | 0.0554 |
Goodness-of-fit parameter for all reflections included in the refinement | 1.06 |
Diffraction radiation wavelength | 0.71073 Å |
Diffraction radiation type | MoKα |