Information card for entry 4128033
Formula | C168 H90 O24 Zr9 |
Calculated formula | C168 H90 O24 Zr9 |
Title of publication | Ligand Rigidification for Enhancing the Stability of Metal-Organic Frameworks. |
Authors of publication | Lv, Xiu-Liang; Yuan, Shuai; Xie, Lin-Hua; Darke, Hannah F.; Chen, Ya; He, Tao; Dong, Chen; Wang, Bin; Zhang, Yong-Zheng; Li, Jian-Rong; Zhou, Hong-Cai |
Journal of publication | Journal of the American Chemical Society |
Year of publication | 2019 |
Journal volume | 141 |
Journal issue | 26 |
Pages of publication | 10283 - 10293 |
a | 23.0014 ± 0.0004 Å |
b | 23.0014 ± 0.0004 Å |
c | 18.5185 ± 0.0005 Å |
α | 90° |
β | 90° |
γ | 120° |
Cell volume | 8484.9 ± 0.3 Å3 |
Cell temperature | 100 ± 2 K |
Ambient diffraction temperature | 100 ± 2 K |
Number of distinct elements | 4 |
Space group number | 189 |
Hermann-Mauguin space group symbol | P -6 2 m |
Hall space group symbol | P -6 -2 |
Residual factor for all reflections | 0.1621 |
Residual factor for significantly intense reflections | 0.1346 |
Weighted residual factors for significantly intense reflections | 0.3079 |
Weighted residual factors for all reflections included in the refinement | 0.3414 |
Goodness-of-fit parameter for all reflections included in the refinement | 0.994 |
Diffraction radiation wavelength | 1.54178 Å |
Diffraction radiation type | CuKα |