Information card for entry 4128034
Formula | C62 H24 O16 Zr3 |
Calculated formula | C62 H24 O16 Zr3 |
Title of publication | Ligand Rigidification for Enhancing the Stability of Metal-Organic Frameworks. |
Authors of publication | Lv, Xiu-Liang; Yuan, Shuai; Xie, Lin-Hua; Darke, Hannah F.; Chen, Ya; He, Tao; Dong, Chen; Wang, Bin; Zhang, Yong-Zheng; Li, Jian-Rong; Zhou, Hong-Cai |
Journal of publication | Journal of the American Chemical Society |
Year of publication | 2019 |
Journal volume | 141 |
Journal issue | 26 |
Pages of publication | 10283 - 10293 |
a | 22.3176 ± 0.0005 Å |
b | 22.3176 ± 0.0005 Å |
c | 38.8607 ± 0.0008 Å |
α | 90° |
β | 90° |
γ | 90° |
Cell volume | 19355.6 ± 0.7 Å3 |
Cell temperature | 293 ± 2 K |
Ambient diffraction temperature | 293 ± 2 K |
Number of distinct elements | 4 |
Space group number | 128 |
Hermann-Mauguin space group symbol | P 4/m n c |
Hall space group symbol | -P 4 2n |
Residual factor for all reflections | 0.1153 |
Residual factor for significantly intense reflections | 0.0512 |
Weighted residual factors for significantly intense reflections | 0.1417 |
Weighted residual factors for all reflections included in the refinement | 0.1649 |
Goodness-of-fit parameter for all reflections included in the refinement | 0.794 |
Diffraction radiation probe | x-ray |
Diffraction radiation wavelength | 1.54184 Å |
Diffraction radiation type | CuKα |