Information card for entry 4128074
Formula | C8 H16 Cl N O4 |
Calculated formula | C8 H16 Cl N O4 |
Title of publication | Directional Intermolecular Interactions for Precise Molecular Design of a High- T<sub>c</sub> Multiaxial Molecular Ferroelectric. |
Authors of publication | Yang, Chen-Kai; Chen, Wang-Nan; Ding, Yan-Ting; Wang, Jing; Rao, Yin; Liao, Wei-Qiang; Xie, Yongfa; Zou, Wennan; Xiong, Ren-Gen |
Journal of publication | Journal of the American Chemical Society |
Year of publication | 2019 |
Journal volume | 141 |
Journal issue | 4 |
Pages of publication | 1781 - 1787 |
a | 11.4473 ± 0.0007 Å |
b | 8.1623 ± 0.0006 Å |
c | 11.6646 ± 0.0007 Å |
α | 90° |
β | 90° |
γ | 90° |
Cell volume | 1089.9 ± 0.12 Å3 |
Cell temperature | 298 ± 2 K |
Ambient diffraction temperature | 298 ± 2 K |
Number of distinct elements | 5 |
Space group number | 62 |
Hermann-Mauguin space group symbol | P n m a |
Hall space group symbol | -P 2ac 2n |
Residual factor for all reflections | 0.1297 |
Residual factor for significantly intense reflections | 0.1208 |
Weighted residual factors for significantly intense reflections | 0.3244 |
Weighted residual factors for all reflections included in the refinement | 0.3355 |
Goodness-of-fit parameter for all reflections included in the refinement | 1.011 |
Diffraction radiation wavelength | 0.71073 Å |
Diffraction radiation type | MoKα |