Information card for entry 4128075
Formula | C8 H14 Cl N O4 |
Calculated formula | C8 H14 Cl N O4 |
Title of publication | Directional Intermolecular Interactions for Precise Molecular Design of a High- T<sub>c</sub> Multiaxial Molecular Ferroelectric. |
Authors of publication | Yang, Chen-Kai; Chen, Wang-Nan; Ding, Yan-Ting; Wang, Jing; Rao, Yin; Liao, Wei-Qiang; Xie, Yongfa; Zou, Wennan; Xiong, Ren-Gen |
Journal of publication | Journal of the American Chemical Society |
Year of publication | 2019 |
Journal volume | 141 |
Journal issue | 4 |
Pages of publication | 1781 - 1787 |
a | 12.6355 ± 0.0012 Å |
b | 8.692 ± 0.0007 Å |
c | 9.6224 ± 0.0007 Å |
α | 90° |
β | 90° |
γ | 90° |
Cell volume | 1056.81 ± 0.15 Å3 |
Cell temperature | 298 ± 2 K |
Ambient diffraction temperature | 298 ± 2 K |
Number of distinct elements | 5 |
Space group number | 62 |
Hermann-Mauguin space group symbol | P n m a |
Hall space group symbol | -P 2ac 2n |
Residual factor for all reflections | 0.1442 |
Residual factor for significantly intense reflections | 0.127 |
Weighted residual factors for significantly intense reflections | 0.3422 |
Weighted residual factors for all reflections included in the refinement | 0.3541 |
Goodness-of-fit parameter for all reflections included in the refinement | 1.022 |
Diffraction radiation wavelength | 0.71073 Å |
Diffraction radiation type | MoKα |