Information card for entry 4128123
Formula | C15 H9 N2 S2 |
Calculated formula | C15 H9 N2 S2 |
SMILES | S1S[N]C(=N1)c1c2c(cc3c1cccc3)cccc2 |
Title of publication | Structural, Magnetic, and Optical Studies of the Polymorphic 9'-Anthracenyl Dithiadiazolyl Radical. |
Authors of publication | Beldjoudi, Yassine; Arauzo, Ana; Campo, Javier; Gavey, Emma L.; Pilkington, Melanie; Nascimento, Mitchell A.; Rawson, Jeremy M. |
Journal of publication | Journal of the American Chemical Society |
Year of publication | 2019 |
Journal volume | 141 |
Journal issue | 17 |
Pages of publication | 6875 - 6889 |
a | 10.212 ± 0.005 Å |
b | 7.996 ± 0.004 Å |
c | 15.782 ± 0.006 Å |
α | 90° |
β | 100.49 ± 0.03° |
γ | 90° |
Cell volume | 1267.1 ± 1 Å3 |
Cell temperature | 280 ± 2 K |
Ambient diffraction temperature | 280 ± 2 K |
Number of distinct elements | 4 |
Space group number | 14 |
Hermann-Mauguin space group symbol | P 1 21/c 1 |
Hall space group symbol | -P 2ybc |
Residual factor for all reflections | 0.1465 |
Residual factor for significantly intense reflections | 0.0916 |
Weighted residual factors for significantly intense reflections | 0.2508 |
Weighted residual factors for all reflections included in the refinement | 0.3097 |
Goodness-of-fit parameter for all reflections included in the refinement | 1.079 |
Diffraction radiation wavelength | 1.54178 Å |
Diffraction radiation type | CuKα |