Information card for entry 4128124
Formula | C15 H9 N2 S2 |
Calculated formula | C15 H9 N2 S2 |
SMILES | C1(=NSS[N]1)c1c2ccccc2cc2ccccc12 |
Title of publication | Structural, Magnetic, and Optical Studies of the Polymorphic 9'-Anthracenyl Dithiadiazolyl Radical. |
Authors of publication | Beldjoudi, Yassine; Arauzo, Ana; Campo, Javier; Gavey, Emma L.; Pilkington, Melanie; Nascimento, Mitchell A.; Rawson, Jeremy M. |
Journal of publication | Journal of the American Chemical Society |
Year of publication | 2019 |
Journal volume | 141 |
Journal issue | 17 |
Pages of publication | 6875 - 6889 |
a | 14.762 ± 0.008 Å |
b | 10.712 ± 0.006 Å |
c | 8.346 ± 0.005 Å |
α | 90° |
β | 97.792 ± 0.016° |
γ | 90° |
Cell volume | 1307.6 ± 1.3 Å3 |
Cell temperature | 253 ± 2 K |
Ambient diffraction temperature | 253 K |
Number of distinct elements | 4 |
Space group number | 14 |
Hermann-Mauguin space group symbol | P 1 21/c 1 |
Hall space group symbol | -P 2ybc |
Residual factor for all reflections | 0.2058 |
Residual factor for significantly intense reflections | 0.1262 |
Weighted residual factors for significantly intense reflections | 0.2697 |
Weighted residual factors for all reflections included in the refinement | 0.3198 |
Goodness-of-fit parameter for all reflections included in the refinement | 1.066 |
Diffraction radiation wavelength | 0.71073 Å |
Diffraction radiation type | MoKα |