Information card for entry 4128136
Formula | C34 H74 Al2 P4 Si4 |
Calculated formula | C34 H74 Al2 P4 Si4 |
Title of publication | Direct Functionalization of White Phosphorus to Cyclotetraphosphanes: Selective Formation of Four P-C Bonds. |
Authors of publication | Du, Shanshan; Yang, Jimin; Hu, Jingyuan; Chai, Zhengqi; Luo, Gen; Luo, Yi; Zhang, Wen-Xiong; Xi, Zhenfeng |
Journal of publication | Journal of the American Chemical Society |
Year of publication | 2019 |
Journal volume | 141 |
Journal issue | 17 |
Pages of publication | 6843 - 6847 |
a | 14.9811 ± 0.0002 Å |
b | 16.4506 ± 0.0003 Å |
c | 17.9869 ± 0.0003 Å |
α | 90° |
β | 90° |
γ | 90° |
Cell volume | 4432.84 ± 0.12 Å3 |
Cell temperature | 100 ± 0.1 K |
Ambient diffraction temperature | 100 ± 0.1 K |
Number of distinct elements | 5 |
Space group number | 19 |
Hermann-Mauguin space group symbol | P 21 21 21 |
Hall space group symbol | P 2ac 2ab |
Residual factor for all reflections | 0.0831 |
Residual factor for significantly intense reflections | 0.0779 |
Weighted residual factors for significantly intense reflections | 0.2042 |
Weighted residual factors for all reflections included in the refinement | 0.2104 |
Goodness-of-fit parameter for all reflections included in the refinement | 1.061 |
Diffraction radiation probe | x-ray |
Diffraction radiation wavelength | 0.71073 Å |
Diffraction radiation type | MoKα |