Information card for entry 4128140
Formula | C8 H10 Fe N4 |
Calculated formula | C8 H10 Fe N4 |
Title of publication | Solvent-Free Synthesis of ZIFs: A Route toward the Elusive Fe(II) Analogue of ZIF-8. |
Authors of publication | López-Cabrelles, Javier; Romero, Jorge; Abellán, Gonzalo; Giménez-Marqués, Mónica; Palomino, Miguel; Valencia, Susana; Rey, Fernando; Mínguez Espallargas, Guillermo |
Journal of publication | Journal of the American Chemical Society |
Year of publication | 2019 |
Journal volume | 141 |
Journal issue | 17 |
Pages of publication | 7173 - 7180 |
a | 17.1656 ± 0.0002 Å |
b | 17.1656 ± 0.0002 Å |
c | 17.1656 ± 0.0002 Å |
α | 90° |
β | 90° |
γ | 90° |
Cell volume | 5057.98 ± 0.1 Å3 |
Cell temperature | 120 ± 2 K |
Ambient diffraction temperature | 120.15 K |
Number of distinct elements | 4 |
Space group number | 217 |
Hermann-Mauguin space group symbol | I -4 3 m |
Hall space group symbol | I -4 2 3 |
Residual factor for all reflections | 0.0737 |
Residual factor for significantly intense reflections | 0.0482 |
Weighted residual factors for significantly intense reflections | 0.1381 |
Weighted residual factors for all reflections included in the refinement | 0.1456 |
Goodness-of-fit parameter for all reflections included in the refinement | 1.507 |
Diffraction radiation wavelength | 0.71073 Å |
Diffraction radiation type | MoKα |