Information card for entry 4128141
Formula | C16 H14 Fe N4 |
Calculated formula | C16 H14 Fe N4 |
Title of publication | Solvent-Free Synthesis of ZIFs: A Route toward the Elusive Fe(II) Analogue of ZIF-8. |
Authors of publication | López-Cabrelles, Javier; Romero, Jorge; Abellán, Gonzalo; Giménez-Marqués, Mónica; Palomino, Miguel; Valencia, Susana; Rey, Fernando; Mínguez Espallargas, Guillermo |
Journal of publication | Journal of the American Chemical Society |
Year of publication | 2019 |
Journal volume | 141 |
Journal issue | 17 |
Pages of publication | 7173 - 7180 |
a | 9.2434 ± 0.0014 Å |
b | 9.3503 ± 0.0013 Å |
c | 15.9876 ± 0.0018 Å |
α | 90° |
β | 90° |
γ | 90° |
Cell volume | 1381.8 ± 0.3 Å3 |
Cell temperature | 120 ± 2 K |
Ambient diffraction temperature | 120 ± 2 K |
Number of distinct elements | 4 |
Space group number | 19 |
Hermann-Mauguin space group symbol | P 21 21 21 |
Hall space group symbol | P 2ac 2ab |
Residual factor for all reflections | 0.0574 |
Residual factor for significantly intense reflections | 0.0554 |
Weighted residual factors for significantly intense reflections | 0.1323 |
Weighted residual factors for all reflections included in the refinement | 0.1368 |
Goodness-of-fit parameter for all reflections included in the refinement | 1.065 |
Diffraction radiation probe | x-ray |
Diffraction radiation wavelength | 0.71073 Å |
Diffraction radiation type | MoKα |