Information card for entry 4128166
Common name | LIFM-28-BPYDC-Cu |
Formula | C78 H33 Cu F24 I N3 O32 Zr6 |
Calculated formula | C78 H33 Cu F24 I N3 O32 Zr6 |
Title of publication | Catalysis through Dynamic Spacer Installation of Multivariate Functionalities in Metal-Organic Frameworks. |
Authors of publication | Cao, Chen-Chen; Chen, Cheng-Xia; Wei, Zhang-Wen; Qiu, Qian-Feng; Zhu, Neng-Xiu; Xiong, Yang-Yang; Jiang, Ji-Jun; Wang, Dawei; Su, Cheng-Yong |
Journal of publication | Journal of the American Chemical Society |
Year of publication | 2019 |
Journal volume | 141 |
Journal issue | 6 |
Pages of publication | 2589 - 2593 |
a | 22.957 ± 0.0016 Å |
b | 22.957 ± 0.0016 Å |
c | 18.806 ± 0.002 Å |
α | 90° |
β | 90° |
γ | 90° |
Cell volume | 9911.2 ± 1.4 Å3 |
Cell temperature | 173 ± 2 K |
Ambient diffraction temperature | 173 ± 2 K |
Number of distinct elements | 8 |
Space group number | 131 |
Hermann-Mauguin space group symbol | P 42/m m c |
Hall space group symbol | -P 4c 2 |
Residual factor for all reflections | 0.1693 |
Residual factor for significantly intense reflections | 0.1438 |
Weighted residual factors for significantly intense reflections | 0.3202 |
Weighted residual factors for all reflections included in the refinement | 0.3361 |
Goodness-of-fit parameter for all reflections included in the refinement | 0.943 |
Diffraction radiation wavelength | 1.54184 Å |
Diffraction radiation type | CuKα |