Information card for entry 4128167
Common name | LIFM-80 |
Formula | C96 H43 F24 N3 O32 Zr6 |
Calculated formula | C95.9996 H42.9992 F24 N2.9996 O32 Zr6 |
Title of publication | Catalysis through Dynamic Spacer Installation of Multivariate Functionalities in Metal-Organic Frameworks. |
Authors of publication | Cao, Chen-Chen; Chen, Cheng-Xia; Wei, Zhang-Wen; Qiu, Qian-Feng; Zhu, Neng-Xiu; Xiong, Yang-Yang; Jiang, Ji-Jun; Wang, Dawei; Su, Cheng-Yong |
Journal of publication | Journal of the American Chemical Society |
Year of publication | 2019 |
Journal volume | 141 |
Journal issue | 6 |
Pages of publication | 2589 - 2593 |
a | 23.047 ± 0.0012 Å |
b | 23.047 ± 0.0012 Å |
c | 18.6989 ± 0.0015 Å |
α | 90° |
β | 90° |
γ | 90° |
Cell volume | 9932.2 ± 1.1 Å3 |
Cell temperature | 173 ± 2 K |
Ambient diffraction temperature | 173 ± 2 K |
Number of distinct elements | 6 |
Space group number | 131 |
Hermann-Mauguin space group symbol | P 42/m m c |
Hall space group symbol | -P 4c 2 |
Residual factor for all reflections | 0.1774 |
Residual factor for significantly intense reflections | 0.1173 |
Weighted residual factors for significantly intense reflections | 0.2937 |
Weighted residual factors for all reflections included in the refinement | 0.3377 |
Goodness-of-fit parameter for all reflections included in the refinement | 0.96 |
Diffraction radiation wavelength | 1.54184 Å |
Diffraction radiation type | CuKα |