Information card for entry 4129608
Formula | C36 H56 F12 N8 O18 Pd2 Rh2 S4 |
Calculated formula | C36 H56 F12 N8 O18 Pd2 Rh2 S4 |
Title of publication | Rational Design of Polynuclear Organometallic Assemblies from a Simple Heteromultifunctional Ligand. |
Authors of publication | Zhang, Long; Lin, Yue-Jian; Li, Zhen-Hua; Jin, Guo-Xin |
Journal of publication | Journal of the American Chemical Society |
Year of publication | 2015 |
Journal volume | 137 |
Journal issue | 42 |
Pages of publication | 13670 - 13678 |
a | 9.6545 ± 0.0014 Å |
b | 16.056 ± 0.002 Å |
c | 18.637 ± 0.003 Å |
α | 90° |
β | 93.342 ± 0.002° |
γ | 90° |
Cell volume | 2884.1 ± 0.7 Å3 |
Cell temperature | 173 ± 2 K |
Ambient diffraction temperature | 173 ± 2 K |
Number of distinct elements | 8 |
Space group number | 14 |
Hermann-Mauguin space group symbol | P 1 21/c 1 |
Hall space group symbol | -P 2ybc |
Residual factor for all reflections | 0.0736 |
Residual factor for significantly intense reflections | 0.045 |
Weighted residual factors for significantly intense reflections | 0.0866 |
Weighted residual factors for all reflections included in the refinement | 0.0983 |
Goodness-of-fit parameter for all reflections included in the refinement | 0.95 |
Diffraction radiation wavelength | 0.71073 Å |
Diffraction radiation type | MoKα |