Information card for entry 4129609
Formula | C77 H114 F24 Ir4 N20 O38 Pd4 S8 |
Calculated formula | C75 H104 F18 Ir4 N20 O32 Pd4 S6 |
Title of publication | Rational Design of Polynuclear Organometallic Assemblies from a Simple Heteromultifunctional Ligand. |
Authors of publication | Zhang, Long; Lin, Yue-Jian; Li, Zhen-Hua; Jin, Guo-Xin |
Journal of publication | Journal of the American Chemical Society |
Year of publication | 2015 |
Journal volume | 137 |
Journal issue | 42 |
Pages of publication | 13670 - 13678 |
a | 15.226 ± 0.002 Å |
b | 16.217 ± 0.002 Å |
c | 16.576 ± 0.003 Å |
α | 70.478 ± 0.002° |
β | 70.163 ± 0.002° |
γ | 82.134 ± 0.002° |
Cell volume | 3627.5 ± 0.9 Å3 |
Cell temperature | 173 ± 2 K |
Ambient diffraction temperature | 173 ± 2 K |
Number of distinct elements | 8 |
Space group number | 2 |
Hermann-Mauguin space group symbol | P -1 |
Hall space group symbol | -P 1 |
Residual factor for all reflections | 0.1075 |
Residual factor for significantly intense reflections | 0.0576 |
Weighted residual factors for significantly intense reflections | 0.1591 |
Weighted residual factors for all reflections included in the refinement | 0.186 |
Goodness-of-fit parameter for all reflections included in the refinement | 0.946 |
Diffraction radiation wavelength | 0.71073 Å |
Diffraction radiation type | MoKα |