Information card for entry 4132837
Formula | C208 H176 Cl0 Cu8 F0 N8 Ni P16 |
Calculated formula | C208 H176 Cu8 N8 Ni P16 |
Title of publication | Adaptive Coordination-Driven Supramolecular Syntheses toward New Polymetallic Cu(I) Luminescent Assemblies. |
Authors of publication | Evariste, Sloane; Khalil, Ali Moustafa; Moussa, Mehdi Elsayed; Chan, Alan Kwun-Wa; Hong, Eugene Yau-Hin; Wong, Hok-Lai; Le Guennic, Boris; Calvez, Guillaume; Costuas, Karine; Yam, Vivian Wing-Wah; Lescop, Christophe |
Journal of publication | Journal of the American Chemical Society |
Year of publication | 2018 |
Journal volume | 140 |
Journal issue | 39 |
Pages of publication | 12521 - 12526 |
a | 21.9819 ± 0.0008 Å |
b | 40.8081 ± 0.0014 Å |
c | 26.4575 ± 0.0008 Å |
α | 90° |
β | 109.805 ± 0.001° |
γ | 90° |
Cell volume | 22329.6 ± 1.3 Å3 |
Cell temperature | 150 ± 2 K |
Ambient diffraction temperature | 150 ± 2 K |
Number of distinct elements | 8 |
Space group number | 14 |
Hermann-Mauguin space group symbol | P 1 21/n 1 |
Hall space group symbol | -P 2yn |
Residual factor for all reflections | 0.0801 |
Residual factor for significantly intense reflections | 0.0479 |
Weighted residual factors for significantly intense reflections | 0.1282 |
Weighted residual factors for all reflections included in the refinement | 0.1361 |
Goodness-of-fit parameter for all reflections included in the refinement | 1.056 |
Diffraction radiation wavelength | 0.71073 Å |
Diffraction radiation type | MoKα |