Information card for entry 4132838
Formula | C208 H176 Cl0 Cu8 F0 N8 P16 Pt |
Calculated formula | C208 H176 Cu8 N8 P16 Pt |
Title of publication | Adaptive Coordination-Driven Supramolecular Syntheses toward New Polymetallic Cu(I) Luminescent Assemblies. |
Authors of publication | Evariste, Sloane; Khalil, Ali Moustafa; Moussa, Mehdi Elsayed; Chan, Alan Kwun-Wa; Hong, Eugene Yau-Hin; Wong, Hok-Lai; Le Guennic, Boris; Calvez, Guillaume; Costuas, Karine; Yam, Vivian Wing-Wah; Lescop, Christophe |
Journal of publication | Journal of the American Chemical Society |
Year of publication | 2018 |
Journal volume | 140 |
Journal issue | 39 |
Pages of publication | 12521 - 12526 |
a | 22.102 ± 0.003 Å |
b | 41.025 ± 0.007 Å |
c | 26.653 ± 0.003 Å |
α | 90° |
β | 109.729 ± 0.005° |
γ | 90° |
Cell volume | 22749 ± 6 Å3 |
Cell temperature | 150 ± 2 K |
Ambient diffraction temperature | 150 ± 2 K |
Number of distinct elements | 8 |
Space group number | 14 |
Hermann-Mauguin space group symbol | P 1 21/n 1 |
Hall space group symbol | -P 2yn |
Residual factor for all reflections | 0.1172 |
Residual factor for significantly intense reflections | 0.0591 |
Weighted residual factors for significantly intense reflections | 0.1309 |
Weighted residual factors for all reflections included in the refinement | 0.146 |
Goodness-of-fit parameter for all reflections included in the refinement | 0.977 |
Diffraction radiation wavelength | 0.71073 Å |
Diffraction radiation type | MoKα |