Information card for entry 4132955
Formula | C18 H16 N2 O4 |
Calculated formula | C18 H16 N2 O4 |
SMILES | O1C(=O)c2c(NN=C(C(=O)OCCC1)c1ccccc1)cccc2 |
Title of publication | Building Strain with Large Macrocycles and Using It To Tune the Thermal Half-Lives of Hydrazone Photochromes. |
Authors of publication | Li, Quan; Qian, Hai; Shao, Baihao; Hughes, Russell P.; Aprahamian, Ivan |
Journal of publication | Journal of the American Chemical Society |
Year of publication | 2018 |
Journal volume | 140 |
Journal issue | 37 |
Pages of publication | 11829 - 11835 |
a | 8.2576 ± 0.0004 Å |
b | 22.2625 ± 0.001 Å |
c | 17.3321 ± 0.001 Å |
α | 90° |
β | 90.025 ± 0.004° |
γ | 90° |
Cell volume | 3186.2 ± 0.3 Å3 |
Cell temperature | 173 ± 2 K |
Ambient diffraction temperature | 173 ± 2 K |
Number of distinct elements | 4 |
Space group number | 14 |
Hermann-Mauguin space group symbol | P 1 21/c 1 |
Hall space group symbol | -P 2ybc |
Residual factor for all reflections | 0.1151 |
Residual factor for significantly intense reflections | 0.0744 |
Weighted residual factors for significantly intense reflections | 0.1983 |
Weighted residual factors for all reflections included in the refinement | 0.2287 |
Goodness-of-fit parameter for all reflections included in the refinement | 1.019 |
Diffraction radiation wavelength | 1.54178 Å |
Diffraction radiation type | CuKα |