Information card for entry 4132956
Formula | C21 H22 N2 O4 |
Calculated formula | C21 H22 N2 O4 |
SMILES | O1CCCCCCOC(=O)c2c(NN=C(C1=O)c1ccccc1)cccc2 |
Title of publication | Building Strain with Large Macrocycles and Using It To Tune the Thermal Half-Lives of Hydrazone Photochromes. |
Authors of publication | Li, Quan; Qian, Hai; Shao, Baihao; Hughes, Russell P.; Aprahamian, Ivan |
Journal of publication | Journal of the American Chemical Society |
Year of publication | 2018 |
Journal volume | 140 |
Journal issue | 37 |
Pages of publication | 11829 - 11835 |
a | 10.4958 ± 0.0017 Å |
b | 9.1991 ± 0.0015 Å |
c | 19.482 ± 0.003 Å |
α | 90° |
β | 97.6635 ± 0.0019° |
γ | 90° |
Cell volume | 1864.2 ± 0.5 Å3 |
Cell temperature | 173 ± 2 K |
Ambient diffraction temperature | 173 ± 2 K |
Number of distinct elements | 4 |
Space group number | 14 |
Hermann-Mauguin space group symbol | P 1 21/n 1 |
Hall space group symbol | -P 2yn |
Residual factor for all reflections | 0.0635 |
Residual factor for significantly intense reflections | 0.05 |
Weighted residual factors for significantly intense reflections | 0.1325 |
Weighted residual factors for all reflections included in the refinement | 0.1477 |
Goodness-of-fit parameter for all reflections included in the refinement | 1.064 |
Diffraction radiation wavelength | 0.71073 Å |
Diffraction radiation type | MoKα |