Information card for entry 4132957
Formula | C18 H16 N2 O4 |
Calculated formula | C18 H16 N2 O4 |
SMILES | O1CCCOC(=O)c2c(NN=C(C1=O)c1ccccc1)cccc2 |
Title of publication | Building Strain with Large Macrocycles and Using It To Tune the Thermal Half-Lives of Hydrazone Photochromes. |
Authors of publication | Li, Quan; Qian, Hai; Shao, Baihao; Hughes, Russell P.; Aprahamian, Ivan |
Journal of publication | Journal of the American Chemical Society |
Year of publication | 2018 |
Journal volume | 140 |
Journal issue | 37 |
Pages of publication | 11829 - 11835 |
a | 8.5136 ± 0.0008 Å |
b | 10.2478 ± 0.001 Å |
c | 17.2085 ± 0.0017 Å |
α | 90° |
β | 90.122 ± 0.001° |
γ | 90° |
Cell volume | 1501.4 ± 0.3 Å3 |
Cell temperature | 173 ± 2 K |
Ambient diffraction temperature | 173 ± 2 K |
Number of distinct elements | 4 |
Space group number | 14 |
Hermann-Mauguin space group symbol | P 1 21/c 1 |
Hall space group symbol | -P 2ybc |
Residual factor for all reflections | 0.0545 |
Residual factor for significantly intense reflections | 0.0404 |
Weighted residual factors for significantly intense reflections | 0.1019 |
Weighted residual factors for all reflections included in the refinement | 0.1133 |
Goodness-of-fit parameter for all reflections included in the refinement | 1.043 |
Diffraction radiation wavelength | 0.71073 Å |
Diffraction radiation type | MoKα |