Information card for entry 4133079
Formula | C6 H18 B2 Cl4 P2 |
Calculated formula | C6 H18 B2 Cl4 P2 |
SMILES | [B]([P](C)(C)C)(Cl)(Cl)[B]([P](C)(C)C)(Cl)Cl |
Title of publication | Reactivity of Tetrahalo- and Difluorodiboranes(4) toward Lewis Basic Platinum(0): Bis(boryl), Borylborato, and Doubly Boryl-Bridged Platinum Complexes. |
Authors of publication | Muessig, Jonas H.; Prieschl, Dominic; Deißenberger, Andrea; Dewhurst, Rian D.; Dietz, Maximilian; Jiménez-Halla, J Oscar C; Trumpp, Alexandra; Wang, Sunewang R.; Brunecker, Carina; Haefner, Alena; Gärtner, Annalena; Thiess, Torsten; Böhnke, Julian; Radacki, Krzysztof; Bertermann, Rüdiger; Marder, Todd B.; Braunschweig, Holger |
Journal of publication | Journal of the American Chemical Society |
Year of publication | 2018 |
Journal volume | 140 |
Journal issue | 40 |
Pages of publication | 13056 - 13063 |
a | 6.4637 ± 0.0016 Å |
b | 12.672 ± 0.004 Å |
c | 8.946 ± 0.003 Å |
α | 90° |
β | 95.955 ± 0.011° |
γ | 90° |
Cell volume | 728.8 ± 0.4 Å3 |
Cell temperature | 100 ± 2 K |
Ambient diffraction temperature | 100 ± 2 K |
Number of distinct elements | 5 |
Space group number | 14 |
Hermann-Mauguin space group symbol | P 1 21/n 1 |
Hall space group symbol | -P 2yn |
Residual factor for all reflections | 0.0202 |
Residual factor for significantly intense reflections | 0.0174 |
Weighted residual factors for significantly intense reflections | 0.0435 |
Weighted residual factors for all reflections included in the refinement | 0.0443 |
Goodness-of-fit parameter for all reflections included in the refinement | 1.081 |
Diffraction radiation wavelength | 0.71073 Å |
Diffraction radiation type | MoKα |