Information card for entry 4133080
Formula | C54 H106 B2 Br Cl8 N P2 Pt |
Calculated formula | C54 H106 B2 Br Cl8 N P2 Pt |
Title of publication | Reactivity of Tetrahalo- and Difluorodiboranes(4) toward Lewis Basic Platinum(0): Bis(boryl), Borylborato, and Doubly Boryl-Bridged Platinum Complexes. |
Authors of publication | Muessig, Jonas H.; Prieschl, Dominic; Deißenberger, Andrea; Dewhurst, Rian D.; Dietz, Maximilian; Jiménez-Halla, J Oscar C; Trumpp, Alexandra; Wang, Sunewang R.; Brunecker, Carina; Haefner, Alena; Gärtner, Annalena; Thiess, Torsten; Böhnke, Julian; Radacki, Krzysztof; Bertermann, Rüdiger; Marder, Todd B.; Braunschweig, Holger |
Journal of publication | Journal of the American Chemical Society |
Year of publication | 2018 |
Journal volume | 140 |
Journal issue | 40 |
Pages of publication | 13056 - 13063 |
a | 10.061 ± 0.004 Å |
b | 13.999 ± 0.007 Å |
c | 23.687 ± 0.01 Å |
α | 99.726 ± 0.008° |
β | 96.352 ± 0.005° |
γ | 102.088 ± 0.007° |
Cell volume | 3178 ± 2 Å3 |
Cell temperature | 100 ± 2 K |
Ambient diffraction temperature | 100 ± 2 K |
Number of distinct elements | 8 |
Space group number | 2 |
Hermann-Mauguin space group symbol | P -1 |
Hall space group symbol | -P 1 |
Residual factor for all reflections | 0.0629 |
Residual factor for significantly intense reflections | 0.0496 |
Weighted residual factors for significantly intense reflections | 0.116 |
Weighted residual factors for all reflections included in the refinement | 0.1233 |
Goodness-of-fit parameter for all reflections included in the refinement | 1.078 |
Diffraction radiation wavelength | 0.71073 Å |
Diffraction radiation type | MoKα |