Information card for entry 4133127
Common name | GaRhMe |
Chemical name | GaRhMe |
Formula | C23 H28.5 Ga N7.5 Rh |
Calculated formula | C23 H28.5 Ga N7.5 Rh |
Title of publication | Well-Defined Rhodium-Gallium Catalytic Sites in a Metal-Organic Framework: Promoter-Controlled Selectivity in Alkyne Semihydrogenation to E-Alkenes. |
Authors of publication | Desai, Sai Puneet; Ye, Jingyun; Zheng, Jian; Ferrandon, Magali S.; Webber, Thomas E.; Platero-Prats, Ana E; Duan, Jiaxin; Garcia-Holley, Paula; Camaioni, Donald M.; Chapman, Karena W.; Delferro, Massimiliano; Farha, Omar K.; Fulton, John L.; Gagliardi, Laura; Lercher, Johannes A.; Penn, R. Lee; Stein, Andreas; Lu, Connie C. |
Journal of publication | Journal of the American Chemical Society |
Year of publication | 2018 |
Journal volume | 140 |
Journal issue | 45 |
Pages of publication | 15309 - 15318 |
a | 17.4625 ± 0.0007 Å |
b | 12.5659 ± 0.0005 Å |
c | 20.6692 ± 0.0009 Å |
α | 90° |
β | 90° |
γ | 90° |
Cell volume | 4535.5 ± 0.3 Å3 |
Cell temperature | 123 ± 2 K |
Ambient diffraction temperature | 123 ± 2 K |
Number of distinct elements | 5 |
Space group number | 61 |
Hermann-Mauguin space group symbol | P b c a |
Hall space group symbol | -P 2ac 2ab |
Residual factor for all reflections | 0.0219 |
Residual factor for significantly intense reflections | 0.0187 |
Weighted residual factors for significantly intense reflections | 0.0445 |
Weighted residual factors for all reflections included in the refinement | 0.0458 |
Goodness-of-fit parameter for all reflections included in the refinement | 1.051 |
Diffraction radiation wavelength | 0.71073 Å |
Diffraction radiation type | MoKα |