Information card for entry 4133128
Common name | Rh(OPh)diphenylacetylene |
Chemical name | Rh(OPh)diphenylacetylene |
Formula | C41 H42 N7 O Rh |
Calculated formula | C41 H42 N7 O Rh |
SMILES | [Rh]12(Oc3ccccc3)([n]3ccccc3NCCN(CCNc3[n]1cccc3)CCNc1ncccc1)[C](#[C]2c1ccccc1)c1ccccc1 |
Title of publication | Well-Defined Rhodium-Gallium Catalytic Sites in a Metal-Organic Framework: Promoter-Controlled Selectivity in Alkyne Semihydrogenation to E-Alkenes. |
Authors of publication | Desai, Sai Puneet; Ye, Jingyun; Zheng, Jian; Ferrandon, Magali S.; Webber, Thomas E.; Platero-Prats, Ana E; Duan, Jiaxin; Garcia-Holley, Paula; Camaioni, Donald M.; Chapman, Karena W.; Delferro, Massimiliano; Farha, Omar K.; Fulton, John L.; Gagliardi, Laura; Lercher, Johannes A.; Penn, R. Lee; Stein, Andreas; Lu, Connie C. |
Journal of publication | Journal of the American Chemical Society |
Year of publication | 2018 |
Journal volume | 140 |
Journal issue | 45 |
Pages of publication | 15309 - 15318 |
a | 8.842 ± 0.004 Å |
b | 22.611 ± 0.008 Å |
c | 18.333 ± 0.008 Å |
α | 90° |
β | 103.081 ± 0.019° |
γ | 90° |
Cell volume | 3570 ± 3 Å3 |
Cell temperature | 123 ± 2 K |
Ambient diffraction temperature | 123 ± 2 K |
Number of distinct elements | 5 |
Space group number | 14 |
Hermann-Mauguin space group symbol | P 1 21/c 1 |
Hall space group symbol | -P 2ybc |
Residual factor for all reflections | 0.0793 |
Residual factor for significantly intense reflections | 0.0428 |
Weighted residual factors for significantly intense reflections | 0.0666 |
Weighted residual factors for all reflections included in the refinement | 0.076 |
Goodness-of-fit parameter for all reflections included in the refinement | 1.046 |
Diffraction radiation wavelength | 0.71073 Å |
Diffraction radiation type | MoKα |