Information card for entry 4133257
Formula | C84 H86 N2 O11 |
Calculated formula | C84 H86 N2 O11 |
Title of publication | Molecular Recognition of Hydrophilic Molecules in Water by Combining the Hydrophobic Effect with Hydrogen Bonding. |
Authors of publication | Yao, Huan; Ke, Hua; Zhang, Xiaobin; Pan, San-Jiang; Li, Ming-Shuang; Yang, Liu-Pan; Schreckenbach, Georg; Jiang, Wei |
Journal of publication | Journal of the American Chemical Society |
Year of publication | 2018 |
Journal volume | 140 |
Journal issue | 41 |
Pages of publication | 13466 - 13477 |
a | 13.6519 ± 0.0008 Å |
b | 15.7069 ± 0.0009 Å |
c | 17.7443 ± 0.001 Å |
α | 90° |
β | 93.209 ± 0.003° |
γ | 90° |
Cell volume | 3798.9 ± 0.4 Å3 |
Cell temperature | 150 ± 2 K |
Ambient diffraction temperature | 150 K |
Number of distinct elements | 4 |
Space group number | 11 |
Hermann-Mauguin space group symbol | P 1 21/m 1 |
Hall space group symbol | -P 2yb |
Residual factor for all reflections | 0.1113 |
Residual factor for significantly intense reflections | 0.1025 |
Weighted residual factors for significantly intense reflections | 0.3437 |
Weighted residual factors for all reflections included in the refinement | 0.3583 |
Goodness-of-fit parameter for all reflections included in the refinement | 1.632 |
Diffraction radiation probe | x-ray |
Diffraction radiation wavelength | 1.54178 Å |
Diffraction radiation type | CuKα |