Information card for entry 4133258
Formula | C70 H75 N3 O11 |
Calculated formula | C70 H75 N3 O11 |
Title of publication | Molecular Recognition of Hydrophilic Molecules in Water by Combining the Hydrophobic Effect with Hydrogen Bonding. |
Authors of publication | Yao, Huan; Ke, Hua; Zhang, Xiaobin; Pan, San-Jiang; Li, Ming-Shuang; Yang, Liu-Pan; Schreckenbach, Georg; Jiang, Wei |
Journal of publication | Journal of the American Chemical Society |
Year of publication | 2018 |
Journal volume | 140 |
Journal issue | 41 |
Pages of publication | 13466 - 13477 |
a | 11.8762 ± 0.0005 Å |
b | 12.101 ± 0.0005 Å |
c | 12.2447 ± 0.0005 Å |
α | 90.885 ± 0.001° |
β | 92.499 ± 0.002° |
γ | 103.131 ± 0.002° |
Cell volume | 1711.51 ± 0.12 Å3 |
Cell temperature | 160 K |
Ambient diffraction temperature | 160 K |
Number of distinct elements | 4 |
Space group number | 2 |
Hermann-Mauguin space group symbol | P -1 |
Hall space group symbol | -P 1 |
Residual factor for all reflections | 0.0869 |
Residual factor for significantly intense reflections | 0.0818 |
Weighted residual factors for significantly intense reflections | 0.3078 |
Weighted residual factors for all reflections included in the refinement | 0.32 |
Goodness-of-fit parameter for all reflections included in the refinement | 1.507 |
Diffraction radiation wavelength | 1.54178 Å |
Diffraction radiation type | CuKα |