Information card for entry 4133291
Formula | C14 H8 Mn2 N12 W |
Calculated formula | C14 H8 Mn2 N12 W |
Title of publication | A Photomagnetic Sponge: High-Temperature Light-Induced Ferrimagnet Controlled by Water Sorption. |
Authors of publication | Magott, Michał; Reczyński, Mateusz; Gaweł, Bartłomiej; Sieklucka, Barbara; Pinkowicz, Dawid |
Journal of publication | Journal of the American Chemical Society |
Year of publication | 2018 |
Journal volume | 140 |
Journal issue | 46 |
Pages of publication | 15876 - 15882 |
a | 9.981 ± 0.0005 Å |
b | 10.8463 ± 0.0005 Å |
c | 9.8571 ± 0.0005 Å |
α | 103.871 ± 0.003° |
β | 103.223 ± 0.003° |
γ | 95.421 ± 0.004° |
Cell volume | 995.85 ± 0.09 Å3 |
Cell temperature | 293 K |
Ambient diffraction temperature | 293 K |
Number of distinct elements | 5 |
Space group number | 2 |
Hermann-Mauguin space group symbol | P -1 |
Hall space group symbol | -P 1 |
Residual factor for all reflections | 0.0299 |
Residual factor for significantly intense reflections | 0.0296 |
Weighted residual factors for all reflections | 0.0363 |
Weighted residual factors for significantly intense reflections | 0.0363 |
Goodness-of-fit parameter for all reflections | 1.83 |
Method of determination | powder diffraction |
Diffraction radiation probe | x-ray |
Diffraction radiation wavelength | 1.5418 Å |
Diffraction radiation type | CoKα |