Information card for entry 4133292
Formula | C66 H72 B F24 P2 Rh |
Calculated formula | C66 H72 B F24 P2 Rh |
Title of publication | Modulation of σ-Alkane Interactions in [Rh(L<sub>2</sub>)(alkane)]<sup>+</sup> Solid-State Molecular Organometallic (SMOM) Systems by Variation of the Chelating Phosphine and Alkane: Access to η<sup>2</sup>,η<sup>2</sup>-σ-Alkane Rh(I), η<sup>1</sup>-σ-Alkane Rh(III) Complexes, and Alkane Encapsulation. |
Authors of publication | Martínez-Martínez, Antonio J; Tegner, Bengt E.; McKay, Alasdair I.; Bukvic, Alexander J.; Rees, Nicholas H.; Tizzard, Graham J.; Coles, Simon J.; Warren, Mark R.; Macgregor, Stuart A.; Weller, Andrew S. |
Journal of publication | Journal of the American Chemical Society |
Year of publication | 2018 |
Journal volume | 140 |
Journal issue | 44 |
Pages of publication | 14958 - 14970 |
a | 12.8769 ± 0.0001 Å |
b | 20.105 ± 0.0002 Å |
c | 25.9848 ± 0.0003 Å |
α | 86.853 ± 0.001° |
β | 84.592 ± 0.001° |
γ | 89.208 ± 0.001° |
Cell volume | 6686.91 ± 0.12 Å3 |
Cell temperature | 150.01 ± 0.11 K |
Ambient diffraction temperature | 150.01 ± 0.11 K |
Number of distinct elements | 6 |
Space group number | 2 |
Hermann-Mauguin space group symbol | P -1 |
Hall space group symbol | -P 1 |
Residual factor for all reflections | 0.0494 |
Residual factor for significantly intense reflections | 0.0421 |
Weighted residual factors for significantly intense reflections | 0.1046 |
Weighted residual factors for all reflections included in the refinement | 0.1102 |
Goodness-of-fit parameter for all reflections included in the refinement | 1.038 |
Diffraction radiation probe | x-ray |
Diffraction radiation wavelength | 1.54184 Å |
Diffraction radiation type | CuKα |