Information card for entry 4133604
Formula | C49 H68 Al Br3 Ge N4 O2 Si2 |
Calculated formula | C49 H68 Al Br3 Ge N4 O2 Si2 |
SMILES | Br[Al]([Ge]1[Si]2([N](=C(N2C(C)(C)C)c2ccccc2)C(C)(C)C)c2cccc3C(c4c(Oc23)c([Si]21[N](=C(N2C(C)(C)C)c1ccccc1)C(C)(C)C)ccc4)(C)C)(Br)Br.O(CC)CC |
Title of publication | An Isolable Bis(silylene)-Stabilized Germylone and Its Reactivity. |
Authors of publication | Wang, Yuwen; Karni, Miriam; Yao, Shenglai; Apeloig, Yitzhak; Driess, Matthias |
Journal of publication | Journal of the American Chemical Society |
Year of publication | 2019 |
Journal volume | 141 |
Journal issue | 4 |
Pages of publication | 1655 - 1664 |
a | 15.8154 ± 0.0008 Å |
b | 21.7298 ± 0.001 Å |
c | 31.6007 ± 0.0019 Å |
α | 90° |
β | 90° |
γ | 90° |
Cell volume | 10860.1 ± 1 Å3 |
Cell temperature | 150 ± 2 K |
Ambient diffraction temperature | 150 ± 2 K |
Number of distinct elements | 8 |
Space group number | 61 |
Hermann-Mauguin space group symbol | P b c a |
Hall space group symbol | -P 2ac 2ab |
Residual factor for all reflections | 0.114 |
Residual factor for significantly intense reflections | 0.0672 |
Weighted residual factors for significantly intense reflections | 0.1597 |
Weighted residual factors for all reflections included in the refinement | 0.1953 |
Goodness-of-fit parameter for all reflections included in the refinement | 1.034 |
Diffraction radiation wavelength | 1.54184 Å |
Diffraction radiation type | CuKα |