Information card for entry 4134531
Formula | In8 Ir2 Te |
Calculated formula | In8 Ir2 Te |
Title of publication | The Subchalcogenides Ir<sub>2</sub>In<sub>8</sub>Q (Q = S, Se, Te): Dirac Semimetal Candidates with Re-entrant Structural Modulation. |
Authors of publication | Khoury, Jason F.; Rettie, Alexander J. E.; Robredo, Iñigo; Krogstad, Matthew J.; Malliakas, Christos D.; Bergara, Aitor; Vergniory, Maia G.; Osborn, Raymond; Rosenkranz, Stephan; Chung, Duck Young; Kanatzidis, Mercouri G. |
Journal of publication | Journal of the American Chemical Society |
Year of publication | 2020 |
Journal volume | 142 |
Journal issue | 13 |
Pages of publication | 6312 - 6323 |
a | 10.005 ± 0.004 Å |
b | 10.007 ± 0.004 Å |
c | 10.196 ± 0.004 Å |
α | 90° |
β | 90° |
γ | 89.991 ± 0.008° |
Cell volume | 1020.8 ± 0.7 Å3 |
Cell temperature | 115 K |
Ambient diffraction temperature | 115 K |
Number of distinct elements | 3 |
Space group number | 6 |
Hermann-Mauguin space group symbol | P 1 1 m |
Hall space group symbol | P -2 |
Residual factor for all reflections | 0.1237 |
Residual factor for significantly intense reflections | 0.0747 |
Weighted residual factors for significantly intense reflections | 0.1218 |
Weighted residual factors for all reflections included in the refinement | 0.1314 |
Goodness-of-fit parameter for significantly intense reflections | 3.6 |
Goodness-of-fit parameter for all reflections included in the refinement | 2.37 |
Diffraction radiation probe | x-ray |
Diffraction radiation wavelength | 0.71073 Å |
Diffraction radiation type | MoKα |