Information card for entry 4301645
Common name | Silver(I) nitrosodicyanmethanide, Ag(CCO) |
Chemical name | Nitrosodicyanmethanide of Silver(I) |
Formula | C3 Ag N3 O |
Calculated formula | C3 Ag N3 O |
Title of publication | Monovalent K, Cs, Tl, and Ag Nitrosodicyanomethanides: Completely Different 3D Networks with Useful Properties of Luminescent Materials and Nonelectric Sensors for Gases |
Authors of publication | Garrett Glover; Nikolay Gerasimchuk; Richard Biagioni; Konstantin V. Domasevitch |
Journal of publication | Inorganic Chemistry |
Year of publication | 2009 |
Journal volume | 48 |
Pages of publication | 2371 - 2382 |
a | 10.3063 ± 0.0013 Å |
b | 7.986 ± 0.001 Å |
c | 11.5458 ± 0.0015 Å |
α | 90° |
β | 90° |
γ | 90° |
Cell volume | 950.3 ± 0.2 Å3 |
Cell temperature | 296 ± 2 K |
Ambient diffraction temperature | 296 ± 2 K |
Number of distinct elements | 4 |
Space group number | 61 |
Hermann-Mauguin space group symbol | P b c a |
Hall space group symbol | -P 2ac 2ab |
Residual factor for all reflections | 0.0245 |
Residual factor for significantly intense reflections | 0.0237 |
Weighted residual factors for significantly intense reflections | 0.0591 |
Weighted residual factors for all reflections included in the refinement | 0.0596 |
Goodness-of-fit parameter for all reflections included in the refinement | 1.089 |
Diffraction radiation wavelength | 0.71073 Å |
Diffraction radiation type | MoKα |