Information card for entry 4301646
Common name | cesium nitrosodicyanmethanide |
Formula | C3 Cs N3 O |
Calculated formula | C3 Cs N3 O |
Title of publication | Monovalent K, Cs, Tl, and Ag Nitrosodicyanomethanides: Completely Different 3D Networks with Useful Properties of Luminescent Materials and Nonelectric Sensors for Gases |
Authors of publication | Garrett Glover; Nikolay Gerasimchuk; Richard Biagioni; Konstantin V. Domasevitch |
Journal of publication | Inorganic Chemistry |
Year of publication | 2009 |
Journal volume | 48 |
Pages of publication | 2371 - 2382 |
a | 7.816 ± 0.006 Å |
b | 13.137 ± 0.008 Å |
c | 5.65 ± 0.005 Å |
α | 90° |
β | 94.385 ± 0.014° |
γ | 90° |
Cell volume | 578.4 ± 0.8 Å3 |
Cell temperature | 296 ± 2 K |
Ambient diffraction temperature | 296 ± 2 K |
Number of distinct elements | 4 |
Space group number | 14 |
Hermann-Mauguin space group symbol | P 1 21/c 1 |
Hall space group symbol | -P 2ybc |
Residual factor for all reflections | 0.0364 |
Residual factor for significantly intense reflections | 0.0343 |
Weighted residual factors for significantly intense reflections | 0.0815 |
Weighted residual factors for all reflections included in the refinement | 0.0828 |
Goodness-of-fit parameter for all reflections included in the refinement | 1.119 |
Diffraction radiation wavelength | 0.71073 Å |
Diffraction radiation type | MoKα |