Information card for entry 4306378
Formula | C54 H78 Eu2 F36 N12 O48 S12 |
Calculated formula | C54 H78 Eu2 F36 N12 O48 S12 |
Title of publication | Carboxyl-Functionalized Task-Specific Ionic Liquids for Solubilizing Metal Oxides |
Authors of publication | Peter Nockemann; Ben Thijs; Tatjana N. Parac-Vogt; Kristof Van Hecke; Luc Van Meervelt; Bernard Tinant; Ingo Hartenbach; Thomas Schleid; Vu Thi Ngan; Minh Tho Nguyen; Koen Binnemans |
Journal of publication | Inorganic Chemistry |
Year of publication | 2008 |
Journal volume | 47 |
Pages of publication | 9987 - 9999 |
a | 16.056 ± 0.003 Å |
b | 14.767 ± 0.003 Å |
c | 22.585 ± 0.005 Å |
α | 90° |
β | 94.79 ± 0.03° |
γ | 90° |
Cell volume | 5336.2 ± 1.9 Å3 |
Cell temperature | 120 ± 2 K |
Ambient diffraction temperature | 120 ± 2 K |
Number of distinct elements | 7 |
Space group number | 14 |
Hermann-Mauguin space group symbol | P 1 21/n 1 |
Hall space group symbol | -P 2yn |
Residual factor for all reflections | 0.0652 |
Residual factor for significantly intense reflections | 0.0579 |
Weighted residual factors for significantly intense reflections | 0.1505 |
Weighted residual factors for all reflections included in the refinement | 0.1566 |
Goodness-of-fit parameter for all reflections included in the refinement | 1.022 |
Diffraction radiation wavelength | 0.71073 Å |
Diffraction radiation type | MoKα |