Information card for entry 4306379
Formula | C11 H18 F6 N2 O7 S2 |
Calculated formula | C11 H18 F6 N2 O7 S2 |
SMILES | C1COCC[N+]1(CC(=O)OCC)C.C(F)(F)(F)S(=O)(=O)N=S(=O)([O-])C(F)(F)F |
Title of publication | Carboxyl-Functionalized Task-Specific Ionic Liquids for Solubilizing Metal Oxides |
Authors of publication | Peter Nockemann; Ben Thijs; Tatjana N. Parac-Vogt; Kristof Van Hecke; Luc Van Meervelt; Bernard Tinant; Ingo Hartenbach; Thomas Schleid; Vu Thi Ngan; Minh Tho Nguyen; Koen Binnemans |
Journal of publication | Inorganic Chemistry |
Year of publication | 2008 |
Journal volume | 47 |
Pages of publication | 9987 - 9999 |
a | 13.0236 ± 0.0008 Å |
b | 8.5641 ± 0.0007 Å |
c | 17.3436 ± 0.0012 Å |
α | 90° |
β | 110.307 ± 0.003° |
γ | 90° |
Cell volume | 1814.2 ± 0.2 Å3 |
Cell temperature | 100 ± 2 K |
Ambient diffraction temperature | 100 ± 2 K |
Number of distinct elements | 6 |
Space group number | 14 |
Hermann-Mauguin space group symbol | P 1 21/c 1 |
Hall space group symbol | -P 2ybc |
Residual factor for all reflections | 0.0569 |
Residual factor for significantly intense reflections | 0.042 |
Weighted residual factors for significantly intense reflections | 0.0981 |
Weighted residual factors for all reflections included in the refinement | 0.1067 |
Goodness-of-fit parameter for all reflections included in the refinement | 1.043 |
Diffraction radiation wavelength | 1.54178 Å |
Diffraction radiation type | CuKα |